Target
Carbonic anhydrase 5A, mitochondrial
Ligand
BDBM25899
Substrate
BDBM10856
Meas. Tech.
CA Inhibition Assay
Ki
750±n/a nM
Citation
 Temperini, CCecchi, AScozzafava, ASupuran, CT Carbonic anhydrase inhibitors. Interaction of indapamide and related diuretics with 12 mammalian isozymes and X-ray crystallographic studies for the indapamide-isozyme II adduct. Bioorg Med Chem Lett 18:2567-73 (2008)  
Target
Name:
Carbonic anhydrase 5A, mitochondrial
Synonyms:
CA-VA CA5A Carbonate dehydratase VA Carbonic anhydrase 5A (CA VA) Carbonic anhydrase 5A, mitochondrial precursor Carbonic anhydrase VA (CA VA)
Type:
Enzyme
Mol. Mass.:
34755.54
Organism:
Homo sapiens (Human)
Description:
Human (cloned) isozyme
Residue:
305
  
Inhibitor
Name:
BDBM25899
Synonyms:
7-chloro-2-methyl-3-(2-methylphenyl)-4-oxo-1,2,3,4-tetrahydroquinazoline-6-sulfonamide Metolazone Zaroxolyn
Type:
Small organic molecule
Emp. Form.:
C16H16ClN3O3S
Mol. Mass.:
365.835
SMILES:
CC1Nc2cc(Cl)c(cc2C(=O)N1c1ccccc1C)S(N)(=O)=O
:
Substrate
Name:
BDBM10856
Synonyms:
Carbon Dioxide | methanedione
Type:
Small organic molecule
Emp. Form.:
CO2
Mol. Mass.:
44.0095
SMILES:
O=C=O
: