Target
Carbonic anhydrase 7
Ligand
BDBM25903
Substrate
BDBM10856
Meas. Tech.
CA Inhibition Assay
Ki
62±n/a nM
Citation
 Temperini, CCecchi, AScozzafava, ASupuran, CT Carbonic anhydrase inhibitors. Interaction of indapamide and related diuretics with 12 mammalian isozymes and X-ray crystallographic studies for the indapamide-isozyme II adduct. Bioorg Med Chem Lett 18:2567-73 (2008)  
Target
Name:
Carbonic anhydrase 7
Synonyms:
CA-VII CAH7_HUMAN Carbonic anhydrase Carbonic anhydrase VII (CA VII)
Type:
Enzyme
Mol. Mass.:
29664.11
Organism:
Homo sapiens (Human)
Description:
Human cloned isozyme.
Residue:
264
  
Inhibitor
Name:
BDBM25903
Synonyms:
3-(butylamino)-4-phenoxy-5-sulfamoylbenzoic acid Bumex Fordiuran | cid_2471
Type:
Small organic molecule
Emp. Form.:
C17H20N2O5S
Mol. Mass.:
364.416
SMILES:
CCCCNc1cc(cc(c1Oc1ccccc1)S(N)(=O)=O)C(O)=O
:
Substrate
Name:
BDBM10856
Synonyms:
Carbon Dioxide | methanedione
Type:
Small organic molecule
Emp. Form.:
CO2
Mol. Mass.:
44.0095
SMILES:
O=C=O
: