Target
Acidic mammalian chitinase
Ligand
BDBM388679
Substrate
Meas. Tech.
Human AMCase Activity Assay
IC50
<100±n/a nM
Citation
 Mazur, MKoralewski, RBorek, BOlejniczak, SCzestkowski, WJPiotrowicz, MCOlczak, JPGolebiowski, AABartoszewicz, AMaziarz, EKowalski, M Substituted amino triazoles useful as human chitinase inhibitors US Patent  US9944624 Publication Date 4/17/2018 
Target
Name:
Acidic mammalian chitinase
Synonyms:
AMCase CHIA Lung-specific protein TSA1902
Type:
Protein
Mol. Mass.:
52266.66
Organism:
Homo sapiens (Human)
Description:
Q9BZP6
Residue:
476
  
Inhibitor
Name:
BDBM388679
Synonyms:
2-((2S,5S)-4-(1-(5-amino-4H-1,2,4-triazol-3-yl)piperidin-4-yl)-5-(4-chlorobenzyl)-2-methylpiperazin-1-yl)acetic acid US9944624, Ex. 41
Type:
Small organic molecule
Emp. Form.:
C21H30ClN7O2
Mol. Mass.:
447.962
SMILES:
C[C@H]1CN(C(Cc2ccc(Cl)cc2)CN1CC(O)=O)C1CCN(CC1)c1nnc(N)[nH]1
: