Target
Carbonic anhydrase 2
Ligand
BDBM26988
Substrate
BDBM10856
Meas. Tech.
CA Inhibition Assay
Ki
35000000±n/a nM
Citation
 Innocenti, AHilvo, MParkkila, SScozzafava, ASupuran, CT Carbonic anhydrase inhibitors: the membrane-associated isoform XV is highly inhibited by inorganic anions. Bioorg Med Chem Lett 19:1155-8 (2009)  
Target
Name:
Carbonic anhydrase 2
Synonyms:
CA-II CAC Carbonate dehydratase II Carbonic anhydrase 2 (CA-II) Carbonic anhydrase C Carbonic anhydrase II (CA-II) Carbonic anhydrase II (hCA II) | Carbonic anhydrase isoenzyme II (hCA II)
Type:
Enzyme
Mol. Mass.:
29250.71
Organism:
Homo sapiens (Human)
Description:
P00918
Residue:
260
  
Inhibitor
Name:
BDBM26988
Synonyms:
CHEMBL1644029 CHEMBL186200 nitrate ion | nitrooxidane
Type:
Ion
Emp. Form.:
NO3
Mol. Mass.:
62.0054
SMILES:
[O-][N+]([O-])=O
:
Substrate
Name:
BDBM10856
Synonyms:
Carbon Dioxide | methanedione
Type:
Small organic molecule
Emp. Form.:
CO2
Mol. Mass.:
44.0095
SMILES:
O=C=O
: