Target
Nitric oxide synthase, brain
Ligand
BDBM152712
Substrate
Meas. Tech.
Inhibition Assay
Ki
17.0±1.6 nM
Citation
 Silverman, RBJing, QKang, SWang, H Mammalian and bacterial nitric oxide synthase inhibitors US Patent  US9951014 Publication Date 4/24/2018 
Target
Name:
Nitric oxide synthase, brain
Synonyms:
Bnos NC-NOS NOS type I nNOS Neuronal nitric oxide synthase Nitric Oxide Synthase, brain Nitric oxide synthase, brain (nNOS) Nitric-oxide synthase, brain (nNOS) Nos1 | Peptidyl-cysteine S-nitrosylase NOS1
Type:
Enzyme
Mol. Mass.:
160570.98
Organism:
Rattus norvegicus (rat)
Description:
Recombinant nNOS overexpressed in E. coli was used in enzyme assays.
Residue:
1429
  
Inhibitor
Name:
BDBM152712
Synonyms:
4-methyl-6-[2-(5-{methyl[2-(methylamino)ethyl]amino}pyridin-3-yl)ethyl]pyridin-2-amine (14) US9951014, Name 14b | nNOS inhibitor, 2
Type:
Small organic molecule
Emp. Form.:
C17H25N5
Mol. Mass.:
299.4139
SMILES:
CNCCN(C)c1cncc(CCc2cc(C)cc(N)n2)c1
: