Target
Mu-type opioid receptor
Ligand
BDBM462396
Substrate
Meas. Tech.
Inhibitory Activity Assay
Ki
500±n/a nM
Citation
 Shoichet, BKLevit, AManglik, AKobilka, BGmeiner, PHübner, HDengler, DG Mu opioid receptor modulators US Patent  US10780078 Publication Date 9/22/2020 
Target
Name:
Mu-type opioid receptor
Synonyms:
M-OR-1 MOR-1 MUOR1 Mu opiate receptor OPRM1 hMOP | mu-type opioid receptor isoform MOR-1
Type:
G Protein-Coupled Receptor (GPCR)
Mol. Mass.:
44789.51
Organism:
Homo sapiens (Human)
Description:
P35372
Residue:
400
  
Inhibitor
Name:
BDBM462396
Synonyms:
US10780078, Compound DD 277
Type:
Small organic molecule
Emp. Form.:
C20H27N3OS
Mol. Mass.:
357.513
SMILES:
C[C@@H](Cc1ccsc1)NC(=O)NCC1(Cc2ccccc2C1)N(C)C
: