Target
Delta-type opioid receptor
Ligand
BDBM462407
Substrate
Meas. Tech.
Inhibitory Activity Assay
Ki
2000±n/a nM
Citation
 Shoichet, BKLevit, AManglik, AKobilka, BGmeiner, PHübner, HDengler, DG Mu opioid receptor modulators US Patent  US10780078 Publication Date 9/22/2020 
Target
Name:
Delta-type opioid receptor
Synonyms:
D-OR-1 Delta opioid receptor OPIATE Delta OPRD1 OPRK1 | opioid receptor, delta 1
Type:
G Protein-Coupled Receptor (GPCR)
Mol. Mass.:
40382.98
Organism:
Homo sapiens (Human)
Description:
Competition binding assays were carried out using membrane preparations from transfected HN9.10 cells that constitutively expressed the delta opioid receptor.
Residue:
372
  
Inhibitor
Name:
BDBM462407
Synonyms:
US10780078, Compound DD 297B
Type:
Small organic molecule
Emp. Form.:
C20H27N3O2S
Mol. Mass.:
373.512
SMILES:
C[C@@H](Cc1ccsc1)NC(=O)NC[C@]1(Cc2ccc(O)cc2C1)N(C)C
: