Target
A disintegrin and metalloproteinase with thrombospondin motifs 5 [262-930,L692P]
Ligand
BDBM28338
Substrate
WAAG-3R
Meas. Tech.
ADAMTS-5 Enzyme Inhibition Assay
IC50
230±n/a nM
Citation
 Shiozaki, MMaeda, KMiura, TOgoshi, YHaas, JFryer, AMLaird, ERLittmann, NMAndrews, SWJosey, JAMimura, TShinozaki, YYoshiuchi, HInaba, T Novel N-substituted 2-phenyl-1-sulfonylamino-cyclopropane carboxylates as selective ADAMTS-5 (Aggrecanase-2) inhibitors. Bioorg Med Chem Lett 19:1575-80 (2009)  
Target
Name:
A disintegrin and metalloproteinase with thrombospondin motifs 5 [262-930,L692P]
Synonyms:
A disintegrin and metalloproteinase with thrombospondin motifs 5 ADAMTS-5 (Aggrecanase-2) ADAMTS5 ADMP2 | ATS5_HUMAN
Type:
Metalloprotease
Mol. Mass.:
73728.14
Organism:
Homo sapiens (Human)
Description:
Q9UNA0[262-930,L692P]
Residue:
669
  
Inhibitor
Name:
BDBM28338
Synonyms:
(1R,2S)-1-{[4-(4-chlorophenyl)benzene]({2-[5-(methoxycarbonyl)-1H-imidazol-1-yl]ethyl})sulfonamido}-2-phenylcyclopropane-1-carboxylic acid | sulfonylamino-alkanecarboxylate, 52
Type:
Small organic molecule
Emp. Form.:
C29H26ClN3O6S
Mol. Mass.:
580.051
SMILES:
COC(=O)c1cncn1CCN([C@@]1(C[C@H]1c1ccccc1)C(O)=O)S(=O)(=O)c1ccc(cc1)-c1ccc(Cl)cc1
:
Substrate
Name:
WAAG-3R
Synonyms:
Type:
Fluorescent peptide
Mol. Mass.:
1954.08
Organism:
Description:
Residue:
19
ATEGEARGSVIDAPDNPKK