Target
5-hydroxytryptamine receptor 6
Ligand
BDBM28596
Substrate
BDBM21342
Meas. Tech.
Filtration Binding Assay
pH
7.5±n/a
Temperature
295.15±n/a K
Ki
174±n/a nM
Citation
 Singer, JMWilson, MWJohnson, PDGraham, SRCooke, LWRoof, RLBoxer, PAGold, LHMeltzer, LTJanssen, ARoush, NCampbell, JESu, TZHurst, SIStoner, CLSchwarz, JB Synthesis and SAR of tolylamine 5-HT6 antagonists. Bioorg Med Chem Lett 19:2409-12 (2009)  
Target
Name:
5-hydroxytryptamine receptor 6
Synonyms:
5-HT-6 5-hydroxytryptamine receptor 6 (5-HT-6) 5-hydroxytryptamine receptor 6 (5HT6) HTR6 Serotonin 6 (5-HT6) receptor | Serotonin Receptor 6
Type:
G Protein-Coupled Receptor (GPCR)
Mol. Mass.:
46968.43
Organism:
Homo sapiens (Human)
Description:
P50406
Residue:
440
  
Inhibitor
Name:
BDBM28596
Synonyms:
3-[2-methyl-3-(piperidin-4-yl)phenoxymethyl]benzonitrile | tolylpiperidine, 9c
Type:
Small organic molecule
Emp. Form.:
C20H22N2O
Mol. Mass.:
306.4015
SMILES:
Cc1c(OCc2cccc(c2)C#N)cccc1C1CCNCC1
:
Substrate
Name:
BDBM21342
Synonyms:
(4R,7R)-N,N-diethyl-6-methyl-6,11-diazatetracyclo[7.6.1.0^{2,7}.0^{12,16}]hexadeca-1(16),2,9,12,14-pentaene-4-carboxamide LSD LSD,(+) Lysergic Acid Diethylamide [3H]-LSD | d-Isolysergic acid amide
Type:
radiolabeled ligand
Emp. Form.:
C20H25N3O
Mol. Mass.:
323.432
SMILES:
[H][C@@]12Cc3c[nH]c4cccc(C1=C[C@H](CN2C)C(=O)N(CC)CC)c34
: