Target
15-hydroxyprostaglandin dehydrogenase [NAD(+)]
Ligand
BDBM347368
Substrate
Meas. Tech.
in vitro assay
IC50
1.37±n/a nM
Citation
 Markowitz, SWillson, JKPosner, BReady, JZhang, YTai, HAntczak, MGerson, SBae, KYang, SYDesai, A Compositions and methods of modulating 15-PGDH activity US Patent  US10301320 Publication Date 5/28/2019 
Target
Name:
15-hydroxyprostaglandin dehydrogenase [NAD(+)]
Synonyms:
15-PGDH HPGD PGDH_HUMAN SDR36C1
Type:
Enzyme
Mol. Mass.:
28974.46
Organism:
Homo sapiens (Human)
Description:
P15428
Residue:
266
  
Inhibitor
Name:
BDBM347368
Synonyms:
US10301320, ID SW208066 US20230285402, ID # SW208066 | US9789116, SW208066
Type:
Small organic molecule
Emp. Form.:
C20H19N3OS3
Mol. Mass.:
413.579
SMILES:
CCCCS(=O)c1sc2nc(cc(-c3ccccc3)c2c1N)-c1nccs1
: