Target
Cytochrome P450 3A4
Ligand
BDBM50061625
Substrate
Meas. Tech.
Inhibition Assay
IC50
10650±n/a nM
Citation
 Diaz, PIsoherranen, NButtrick, BGuilloteau, N Specific inhibitors of cytochrome P450 26 retinoic acid hydroxylase US Patent  US9963439 Publication Date 5/8/2018 
Target
Name:
Cytochrome P450 3A4
Synonyms:
Albendazole monooxygenase CP3A4_HUMAN CYP3A4 CYPIIIA4 Cytochrome P450 3A4 (CYP3A4) Nifedipine oxidase Taurochenodeoxycholate 6-alpha-hydroxylase
Type:
Enzyme
Mol. Mass.:
57349.57
Organism:
Homo sapiens (Human)
Description:
Residue:
503
  
Inhibitor
Name:
BDBM50061625
Synonyms:
4-[(5,5,8,8-tetramethyl-5,6,7,8-tetrahydronaphthalen-2-yl)carbamoyl]benzoic acid CHEMBL25202 US11744839, Compound of formula 3 retinobenzoic acid
Type:
Small organic molecule
Emp. Form.:
C22H25NO3
Mol. Mass.:
351.4388
SMILES:
CC1(C)CCC(C)(C)c2cc(NC(=O)c3ccc(cc3)C(O)=O)ccc12
: