Target
5-hydroxytryptamine receptor 1A
Ligand
BDBM312156
Substrate
Meas. Tech.
Binding Assay
IC50
0.97±0.0 nM
Citation
 Bhat, LMohapatra, PPAdiey, K Arylpiperazine derivatives and methods of utilizing same US Patent  US9975862 Publication Date 5/22/2018 
Target
Name:
5-hydroxytryptamine receptor 1A
Synonyms:
5-HT-1A 5-hydroxytryptamine receptor 1A (5-HT-1A) ADRB2RL1 Dopamine D2 receptor and serotonin 1a receptor HTR1A | Serotonin receptor 1A
Type:
Mol. Mass.:
46122.49
Organism:
Homo sapiens (Human)
Description:
Residue:
422
  
Inhibitor
Name:
BDBM312156
Synonyms:
6-(4-(4-(2-Methoxyphenyl)piperazin-1-yl)butoxy)-2H-benzo[b][1,4]oxazin-3(4H)-one US9604944, 15a (Example 13) | US9975862, 15a (Example 13)
Type:
Small organic molecule
Emp. Form.:
C23H29N3O4
Mol. Mass.:
411.4941
SMILES:
COc1ccccc1N1CCN(CCCCOc2ccc3OCC(=O)Nc3c2)CC1
: