Target
Runt-related transcription factor 1
Ligand
BDBM29642
Substrate
Venus-CBFbeta-SMMHC
Meas. Tech.
Identification of compounds inhibiting the binding between the RUNX1 Runt domain and CBFbeta-SMMHC via a time resolved fluorescence resonance energy transfer (TR-FRET) assay.
pH
7.4±n/a
Temperature
296.15±n/a K
IC50
100000±n/a nM
Citation
 PubChem, PC Identification of compounds inhibiting the binding between the RUNX1 Runt domain and CBFb-SMMHC via a time resolved fluorescence resonance energy transfer (TR-FRET) assay. PubChem Bioassay (2009)[AID] 
Target
Name:
Runt-related transcription factor 1
Synonyms:
AML1 CBF-alpha-2 Core-binding factor subunit alpha-2 Polyomavirus enhancer-binding protein 2 alpha B subunit RUNX1_HUMAN | Runt-Related Transcription Factor 1 Isoform AML1C
Type:
Subunit of heterodimeric transcription factor
Mol. Mass.:
48750.25
Organism:
Homo sapiens (Human)
Description:
Q01196
Residue:
453
  
Inhibitor
Name:
BDBM29642
Synonyms:
4-[(5-thiophen-2-yl-2-thiophenyl)methylideneamino]phenol 4-[[5-(2-thienyl)-2-thienyl]methyleneamino]phenol MLS000106248 cid_796420
Type:
Small organic molecule
Emp. Form.:
C15H11NOS2
Mol. Mass.:
285.384
SMILES:
Oc1ccc(cc1)\N=C\c1ccc(s1)-c1cccs1
:
Substrate
Name:
Core-binding factor subunit beta isoform 2
Synonyms:
CBFB PEBB_HUMAN Venus-core-binding factor subunit beta-smooth muscle myosin heavy chain
Type:
Fluorescent fusion protein
Mol. Mass.:
21988.19
Organism:
Homo sapiens (Human)
Description:
Q13951-2
Residue:
187