Target
Runt-related transcription factor 1
Ligand
BDBM29615
Substrate
Venus-CBFbeta-SMMHC
Meas. Tech.
uHTS identification of compounds inhibiting the binding between the RUNX1 Runt domain and CBFb-SMMHC via a fluorescence resonance energy transfer (FRET) assay.
pH
7.4±n/a
Temperature
296.15±n/a K
IC50
15400±n/a nM
Citation
 PubChem, PC uHTS identification of compounds inhibiting the binding between the RUNX1 Runt domain and CBFbeta-SMMHC via a fluorescence resonance energy transfer (FRET) assay. PubChem Bioassay (2009)[AID] 
Target
Name:
Runt-related transcription factor 1
Synonyms:
AML1 CBF-alpha-2 Core-binding factor subunit alpha-2 Polyomavirus enhancer-binding protein 2 alpha B subunit RUNX1_HUMAN | Runt-Related Transcription Factor 1 Isoform AML1C
Type:
Subunit of heterodimeric transcription factor
Mol. Mass.:
48750.25
Organism:
Homo sapiens (Human)
Description:
Q01196
Residue:
453
  
Inhibitor
Name:
BDBM29615
Synonyms:
6-methoxy-3a,4,5,9b-tetrahydro-3H-cyclopenta[c]quinoline-4-carboxylic acid SMR000009698 cid_652912
Type:
Small organic molecule
Emp. Form.:
C14H15NO3
Mol. Mass.:
245.2738
SMILES:
COc1cccc2C3C=CCC3C(Nc12)C(O)=O
:
Substrate
Name:
Core-binding factor subunit beta isoform 2
Synonyms:
CBFB PEBB_HUMAN Venus-core-binding factor subunit beta-smooth muscle myosin heavy chain
Type:
Fluorescent fusion protein
Mol. Mass.:
21988.19
Organism:
Homo sapiens (Human)
Description:
Q13951-2
Residue:
187