Target
Runt-related transcription factor 1
Ligand
BDBM29619
Substrate
Venus-CBFbeta-SMMHC
Meas. Tech.
uHTS identification of compounds inhibiting the binding between the RUNX1 Runt domain and CBFb-SMMHC via a fluorescence resonance energy transfer (FRET) assay.
pH
7.4±n/a
Temperature
296.15±n/a K
IC50
45100±n/a nM
Citation
 PubChem, PC uHTS identification of compounds inhibiting the binding between the RUNX1 Runt domain and CBFbeta-SMMHC via a fluorescence resonance energy transfer (FRET) assay. PubChem Bioassay (2009)[AID] 
Target
Name:
Runt-related transcription factor 1
Synonyms:
AML1 CBF-alpha-2 Core-binding factor subunit alpha-2 Polyomavirus enhancer-binding protein 2 alpha B subunit RUNX1_HUMAN | Runt-Related Transcription Factor 1 Isoform AML1C
Type:
Subunit of heterodimeric transcription factor
Mol. Mass.:
48750.25
Organism:
Homo sapiens (Human)
Description:
Q01196
Residue:
453
  
Inhibitor
Name:
BDBM29619
Synonyms:
6-ethyl-6-methyl-5,8-dihydro-1H-thiopyrano[2,3]thieno[2,4-b]pyrimidine-2,4-dione MLS000071370 cid_657862
Type:
Small organic molecule
Emp. Form.:
C12H14N2O2S2
Mol. Mass.:
282.382
SMILES:
CCC1(C)Cc2c(CS1)sc1[nH]c(=O)[nH]c(=O)c21
:
Substrate
Name:
Core-binding factor subunit beta isoform 2
Synonyms:
CBFB PEBB_HUMAN Venus-core-binding factor subunit beta-smooth muscle myosin heavy chain
Type:
Fluorescent fusion protein
Mol. Mass.:
21988.19
Organism:
Homo sapiens (Human)
Description:
Q13951-2
Residue:
187