Target
Runt-related transcription factor 1
Ligand
BDBM29649
Substrate
Venus-CBFbeta-SMMHC
Meas. Tech.
uHTS identification of compounds inhibiting the binding between the RUNX1 Runt domain and CBFb-SMMHC via a fluorescence resonance energy transfer (FRET) assay.
pH
7.4±n/a
Temperature
296.15±n/a K
IC50
60900±n/a nM
Citation
 PubChem, PC uHTS identification of compounds inhibiting the binding between the RUNX1 Runt domain and CBFbeta-SMMHC via a fluorescence resonance energy transfer (FRET) assay. PubChem Bioassay (2009)[AID] 
Target
Name:
Runt-related transcription factor 1
Synonyms:
AML1 CBF-alpha-2 Core-binding factor subunit alpha-2 Polyomavirus enhancer-binding protein 2 alpha B subunit RUNX1_HUMAN | Runt-Related Transcription Factor 1 Isoform AML1C
Type:
Subunit of heterodimeric transcription factor
Mol. Mass.:
48750.25
Organism:
Homo sapiens (Human)
Description:
Q01196
Residue:
453
  
Inhibitor
Name:
BDBM29649
Synonyms:
6-amino-5-cyano-2-[[(3-cyano-6-methyl-7,8-dihydro-5H-1,6-naphthyridin-2-yl)thio]methyl]-4-(2-fluorophenyl)-4H-pyran-3-carboxylic acid methyl ester SMR000115112 methyl 6-amino-5-cyano-2-[(3-cyano-6-methyl-7,8-dihydro-5H-1,6-naphthyridin-2-yl)sulfanylmethyl]-4-(2-fluorophenyl)-4H-pyran-3-carboxylate methyl 6-azanyl-5-cyano-2-[(3-cyano-6-methyl-7,8-dihydro-5H-1,6-naphthyridin-2-yl)sulfanylmethyl]-4-(2-fluorophenyl)-4H-pyran-3-carboxylate
Type:
Small organic molecule
Emp. Form.:
C25H22FN5O3S
Mol. Mass.:
491.537
SMILES:
COC(=O)C1=C(CSc2nc3CCN(C)Cc3cc2C#N)OC(N)=C(C#N)C1c1ccccc1F
:
Substrate
Name:
Core-binding factor subunit beta isoform 2
Synonyms:
CBFB PEBB_HUMAN Venus-core-binding factor subunit beta-smooth muscle myosin heavy chain
Type:
Fluorescent fusion protein
Mol. Mass.:
21988.19
Organism:
Homo sapiens (Human)
Description:
Q13951-2
Residue:
187