Target
Runt-related transcription factor 1
Ligand
BDBM29651
Substrate
Venus-CBFbeta-SMMHC
Meas. Tech.
uHTS identification of compounds inhibiting the binding between the RUNX1 Runt domain and CBFb-SMMHC via a fluorescence resonance energy transfer (FRET) assay.
pH
7.4±n/a
Temperature
296.15±n/a K
IC50
100000±n/a nM
Citation
 PubChem, PC uHTS identification of compounds inhibiting the binding between the RUNX1 Runt domain and CBFbeta-SMMHC via a fluorescence resonance energy transfer (FRET) assay. PubChem Bioassay (2009)[AID] 
Target
Name:
Runt-related transcription factor 1
Synonyms:
AML1 CBF-alpha-2 Core-binding factor subunit alpha-2 Polyomavirus enhancer-binding protein 2 alpha B subunit RUNX1_HUMAN | Runt-Related Transcription Factor 1 Isoform AML1C
Type:
Subunit of heterodimeric transcription factor
Mol. Mass.:
48750.25
Organism:
Homo sapiens (Human)
Description:
Q01196
Residue:
453
  
Inhibitor
Name:
BDBM29651
Synonyms:
(3Z)-3-[(3-chloro-4-fluoro-anilino)-mercapto-methylene]-2,2-diketo-1-methyl-thieno[3,2-c]thiazin-4-one (3Z)-3-[(3-chloro-4-fluoroanilino)-sulfanylmethylidene]-1-methyl-2,2-dioxothieno[3,2-c]thiazin-4-one MLS000544867 SMR000126624 | cid_9550027
Type:
Small organic molecule
Emp. Form.:
C14H10ClFN2O3S3
Mol. Mass.:
404.887
SMILES:
CN1c2ccsc2C(=O)C(C(=S)Nc2ccc(F)c(Cl)c2)S1(=O)=O
:
Substrate
Name:
Core-binding factor subunit beta isoform 2
Synonyms:
CBFB PEBB_HUMAN Venus-core-binding factor subunit beta-smooth muscle myosin heavy chain
Type:
Fluorescent fusion protein
Mol. Mass.:
21988.19
Organism:
Homo sapiens (Human)
Description:
Q13951-2
Residue:
187