Target
Runt-related transcription factor 1
Ligand
BDBM29654
Substrate
Venus-CBFbeta-SMMHC
Meas. Tech.
uHTS identification of compounds inhibiting the binding between the RUNX1 Runt domain and CBFb-SMMHC via a fluorescence resonance energy transfer (FRET) assay.
pH
7.4±n/a
Temperature
296.15±n/a K
IC50
100000±n/a nM
Citation
 PubChem, PC uHTS identification of compounds inhibiting the binding between the RUNX1 Runt domain and CBFbeta-SMMHC via a fluorescence resonance energy transfer (FRET) assay. PubChem Bioassay (2009)[AID] 
Target
Name:
Runt-related transcription factor 1
Synonyms:
AML1 CBF-alpha-2 Core-binding factor subunit alpha-2 Polyomavirus enhancer-binding protein 2 alpha B subunit RUNX1_HUMAN | Runt-Related Transcription Factor 1 Isoform AML1C
Type:
Subunit of heterodimeric transcription factor
Mol. Mass.:
48750.25
Organism:
Homo sapiens (Human)
Description:
Q01196
Residue:
453
  
Inhibitor
Name:
BDBM29654
Synonyms:
2-methyl-N-(2-oxidanylidenebenzo[g][1,3]benzoxathiol-5-yl)-N-thiophen-2-ylsulfonyl-propanamide 2-methyl-N-(2-oxobenzo[g][1,3]benzoxathiol-5-yl)-N-thiophen-2-ylsulfonylpropanamide N-(2-ketobenzo[g][1,3]benzoxathiol-5-yl)-2-methyl-N-(2-thienylsulfonyl)propionamide cid_3664863
Type:
Small organic molecule
Emp. Form.:
C19H15NO5S3
Mol. Mass.:
433.521
SMILES:
CC(C)C(=O)N(c1cc2sc(=O)oc2c2ccccc12)S(=O)(=O)c1cccs1
:
Substrate
Name:
Core-binding factor subunit beta isoform 2
Synonyms:
CBFB PEBB_HUMAN Venus-core-binding factor subunit beta-smooth muscle myosin heavy chain
Type:
Fluorescent fusion protein
Mol. Mass.:
21988.19
Organism:
Homo sapiens (Human)
Description:
Q13951-2
Residue:
187