Target
Runt-related transcription factor 1
Ligand
BDBM29655
Substrate
Venus-CBFbeta-SMMHC
Meas. Tech.
uHTS identification of compounds inhibiting the binding between the RUNX1 Runt domain and CBFb-SMMHC via a fluorescence resonance energy transfer (FRET) assay.
pH
7.4±n/a
Temperature
296.15±n/a K
IC50
73700±n/a nM
Citation
 PubChem, PC uHTS identification of compounds inhibiting the binding between the RUNX1 Runt domain and CBFbeta-SMMHC via a fluorescence resonance energy transfer (FRET) assay. PubChem Bioassay (2009)[AID] 
Target
Name:
Runt-related transcription factor 1
Synonyms:
AML1 CBF-alpha-2 Core-binding factor subunit alpha-2 Polyomavirus enhancer-binding protein 2 alpha B subunit RUNX1_HUMAN | Runt-Related Transcription Factor 1 Isoform AML1C
Type:
Subunit of heterodimeric transcription factor
Mol. Mass.:
48750.25
Organism:
Homo sapiens (Human)
Description:
Q01196
Residue:
453
  
Inhibitor
Name:
BDBM29655
Synonyms:
MLS000557332 N-[3-cyano-1-(2-furanylmethyl)-10-methyl-5-oxo-2-dipyrido[3,4-c:1',2'-f]pyrimidinylidene]-4-methoxybenzamide N-[3-cyano-1-(furan-2-ylmethyl)-10-methyl-5-oxidanylidene-dipyrido[3,4-c:1',2'-f]pyrimidin-2-ylidene]-4-methoxy-benzamide SMR000148249 | cid_1892604
Type:
Small organic molecule
Emp. Form.:
C26H19N5O4
Mol. Mass.:
465.4602
SMILES:
COc1ccc(cc1)C(=O)\N=c1/c(cc2c(nc3c(C)cccn3c2=O)n1Cc1ccco1)C#N
:
Substrate
Name:
Core-binding factor subunit beta isoform 2
Synonyms:
CBFB PEBB_HUMAN Venus-core-binding factor subunit beta-smooth muscle myosin heavy chain
Type:
Fluorescent fusion protein
Mol. Mass.:
21988.19
Organism:
Homo sapiens (Human)
Description:
Q13951-2
Residue:
187