Target
Runt-related transcription factor 1
Ligand
BDBM29677
Substrate
Venus-CBFbeta-SMMHC
Meas. Tech.
uHTS identification of compounds inhibiting the binding between the RUNX1 Runt domain and CBFb-SMMHC via a fluorescence resonance energy transfer (FRET) assay.
pH
7.4±n/a
Temperature
296.15±n/a K
IC50
100000±n/a nM
Citation
 PubChem, PC uHTS identification of compounds inhibiting the binding between the RUNX1 Runt domain and CBFbeta-SMMHC via a fluorescence resonance energy transfer (FRET) assay. PubChem Bioassay (2009)[AID] 
Target
Name:
Runt-related transcription factor 1
Synonyms:
AML1 CBF-alpha-2 Core-binding factor subunit alpha-2 Polyomavirus enhancer-binding protein 2 alpha B subunit RUNX1_HUMAN | Runt-Related Transcription Factor 1 Isoform AML1C
Type:
Subunit of heterodimeric transcription factor
Mol. Mass.:
48750.25
Organism:
Homo sapiens (Human)
Description:
Q01196
Residue:
453
  
Inhibitor
Name:
BDBM29677
Synonyms:
(3E)-3-(2-furanylmethylidene)-1,2-dihydrocyclopenta[b]quinoline-9-carboxylic acid [2-[2-cyanoethyl(methyl)amino]-2-oxoethyl] ester MLS000335532 [2-[2-cyanoethyl(methyl)amino]-2-oxidanylidene-ethyl] (3E)-3-(furan-2-ylmethylidene)-1,2-dihydrocyclopenta[b]quinoline-9-carboxylate cid_5801934
Type:
Small organic molecule
Emp. Form.:
C24H21N3O4
Mol. Mass.:
415.4412
SMILES:
CN(CCC#N)C(=O)COC(=O)c1c2CC\C(=C/c3ccco3)c2nc2ccccc12
:
Substrate
Name:
Core-binding factor subunit beta isoform 2
Synonyms:
CBFB PEBB_HUMAN Venus-core-binding factor subunit beta-smooth muscle myosin heavy chain
Type:
Fluorescent fusion protein
Mol. Mass.:
21988.19
Organism:
Homo sapiens (Human)
Description:
Q13951-2
Residue:
187