Target
5-hydroxytryptamine receptor 1A
Ligand
BDBM30676
Substrate
Not Available
Meas. Tech.
Dose Response Assay for Agonists of 5-Hydroxytryptamine (Serotonin) Receptor Subtype 1A (5HT1A)
pH
7.4±n/a
Temperature
296.15±n/a K
EC50
99000±n/a nM
Citation
 PubChem, PC Dose Response Assay for 5-Hydroxytryptamine (Serotonin) Receptor Subtype 1a (5HT1a) Agonists PubChem Bioassay (2007)[AID] 
Target
Name:
5-hydroxytryptamine receptor 1A
Synonyms:
5-HT-1A 5-hydroxytryptamine receptor 1A (5-HT-1A) ADRB2RL1 Dopamine D2 receptor and serotonin 1a receptor HTR1A | Serotonin receptor 1A
Type:
Mol. Mass.:
46122.49
Organism:
Homo sapiens (Human)
Description:
Residue:
422
  
Inhibitor
Name:
BDBM30676
Synonyms:
3-[(1-Cyclopentyl-1H-tetrazol-5-yl)-(furan-2-ylmethyl-pyridin-3-ylmethyl-amino)-methyl]-6-methyl-1H-quinolin-2-one 3-[(1-cyclopentyl-5-tetrazolyl)-[2-furanylmethyl(3-pyridinylmethyl)amino]methyl]-6-methyl-1H-quinolin-2-one 3-[(1-cyclopentyltetrazol-5-yl)-[furan-2-ylmethyl(pyridin-3-ylmethyl)amino]methyl]-6-methyl-1H-quinolin-2-one SMR000012871 | cid_652016
Type:
Small organic molecule
Emp. Form.:
C28H29N7O2
Mol. Mass.:
495.5756
SMILES:
Cc1ccc2[nH]c(=O)c(cc2c1)C(N(Cc1ccco1)Cc1cccnc1)c1nnnn1C1CCCC1
:
Substrate
Name:
Not Available
Synonyms:
Type:
Mol. Mass.:
358.43
Organism:
Description:
Residue:
3
NA