Target
5-hydroxytryptamine receptor 1A
Ligand
BDBM30679
Substrate
Not Available
Meas. Tech.
Dose Response Assay for Agonists of 5-Hydroxytryptamine (Serotonin) Receptor Subtype 1A (5HT1A)
pH
7.4±n/a
Temperature
296.15±n/a K
EC50
42100±n/a nM
Citation
 PubChem, PC Dose Response Assay for 5-Hydroxytryptamine (Serotonin) Receptor Subtype 1a (5HT1a) Agonists PubChem Bioassay (2007)[AID] 
Target
Name:
5-hydroxytryptamine receptor 1A
Synonyms:
5-HT-1A 5-hydroxytryptamine receptor 1A (5-HT-1A) ADRB2RL1 Dopamine D2 receptor and serotonin 1a receptor HTR1A | Serotonin receptor 1A
Type:
Mol. Mass.:
46122.49
Organism:
Homo sapiens (Human)
Description:
Residue:
422
  
Inhibitor
Name:
BDBM30679
Synonyms:
1-Allyl-2-imino-10-oxo-1,10-dihydro-2H-1,9,10a-triaza-anthracene-3-carboxylic acid (3-methoxy-propyl)-amide 2-azanylidene-N-(3-methoxypropyl)-5-oxidanylidene-1-prop-2-enyl-dipyrido[1,2-d:3',4'-f]pyrimidine-3-carboxamide 2-imino-N-(3-methoxypropyl)-5-oxo-1-prop-2-enyldipyrido[1,2-d:3',4'-f]pyrimidine-3-carboxamide SMR000013114 | cid_652431
Type:
Small organic molecule
Emp. Form.:
C19H21N5O3
Mol. Mass.:
367.4017
SMILES:
COCCCNC(=O)c1cc2c(nc3ccccn3c2=O)n(CC=C)c1=N
:
Substrate
Name:
Not Available
Synonyms:
Type:
Mol. Mass.:
358.43
Organism:
Description:
Residue:
3
NA