Target
5-hydroxytryptamine receptor 1A
Ligand
BDBM30695
Substrate
Not Available
Meas. Tech.
Dose Response Assay for Agonists of 5-Hydroxytryptamine (Serotonin) Receptor Subtype 1A (5HT1A)
pH
7.4±n/a
Temperature
296.15±n/a K
EC50
99000±n/a nM
Citation
 PubChem, PC Dose Response Assay for 5-Hydroxytryptamine (Serotonin) Receptor Subtype 1a (5HT1a) Agonists PubChem Bioassay (2007)[AID] 
Target
Name:
5-hydroxytryptamine receptor 1A
Synonyms:
5-HT-1A 5-hydroxytryptamine receptor 1A (5-HT-1A) ADRB2RL1 Dopamine D2 receptor and serotonin 1a receptor HTR1A | Serotonin receptor 1A
Type:
Mol. Mass.:
46122.49
Organism:
Homo sapiens (Human)
Description:
Residue:
422
  
Inhibitor
Name:
BDBM30695
Synonyms:
4-Amino-2-methyl-2H-pyrazole-3-carboxylic acid (3-trifluoromethyl-phenyl)-amide 4-amino-2-methyl-N-[3-(trifluoromethyl)phenyl]pyrazole-3-carboxamide MLS000033620 cid_655172
Type:
Small organic molecule
Emp. Form.:
C12H11F3N4O
Mol. Mass.:
284.2371
SMILES:
Cn1ncc(N)c1C(=O)Nc1cccc(c1)C(F)(F)F
:
Substrate
Name:
Not Available
Synonyms:
Type:
Mol. Mass.:
358.43
Organism:
Description:
Residue:
3
NA