Target
5-hydroxytryptamine receptor 1A
Ligand
BDBM31003
Substrate
Not Available
Meas. Tech.
Dose Response Assay for Agonists of 5-Hydroxytryptamine (Serotonin) Receptor Subtype 1A (5HT1A)
pH
7.4±n/a
Temperature
296.15±n/a K
EC50
50000±n/a nM
Citation
 PubChem, PC Dose Response assay for agonists of 5-Hydroxytryptamine (Serotonin) Receptor Subtype 1A (5HT1A) PubChem Bioassay (2007)[AID] 
Target
Name:
5-hydroxytryptamine receptor 1A
Synonyms:
5-HT-1A 5-hydroxytryptamine receptor 1A (5-HT-1A) ADRB2RL1 Dopamine D2 receptor and serotonin 1a receptor HTR1A | Serotonin receptor 1A
Type:
Mol. Mass.:
46122.49
Organism:
Homo sapiens (Human)
Description:
Residue:
422
  
Inhibitor
Name:
BDBM31003
Synonyms:
3-N-(2,3-dimethylphenyl)-1-N-phenylpiperidine-1,3-dicarboxamide N'-(2,3-dimethylphenyl)-N-phenyl-piperidine-1,3-dicarboxamide N3-(2,3-dimethylphenyl)-N1-phenylpiperidine-1,3-dicarboxamide SMR000006943 | cid_654890
Type:
Small organic molecule
Emp. Form.:
C21H25N3O2
Mol. Mass.:
351.4421
SMILES:
Cc1cccc(NC(=O)C2CCCN(C2)C(=O)Nc2ccccc2)c1C
:
Substrate
Name:
Not Available
Synonyms:
Type:
Mol. Mass.:
358.43
Organism:
Description:
Residue:
3
NA