Target
5-hydroxytryptamine receptor 1A
Ligand
BDBM31020
Substrate
Not Available
Meas. Tech.
Dose Response Assay for Agonists of 5-Hydroxytryptamine (Serotonin) Receptor Subtype 1A (5HT1A)
pH
7.4±n/a
Temperature
296.15±n/a K
EC50
50000±n/a nM
Citation
 PubChem, PC Dose Response assay for agonists of 5-Hydroxytryptamine (Serotonin) Receptor Subtype 1A (5HT1A) PubChem Bioassay (2007)[AID] 
Target
Name:
5-hydroxytryptamine receptor 1A
Synonyms:
5-HT-1A 5-hydroxytryptamine receptor 1A (5-HT-1A) ADRB2RL1 Dopamine D2 receptor and serotonin 1a receptor HTR1A | Serotonin receptor 1A
Type:
Mol. Mass.:
46122.49
Organism:
Homo sapiens (Human)
Description:
Residue:
422
  
Inhibitor
Name:
BDBM31020
Synonyms:
5-chloranyl-3-[2-[4-(2,3-dimethylphenyl)piperazin-1-yl]-2-oxidanylidene-ethyl]-1H-indole-2-carboxylic acid 5-chloro-3-[2-[4-(2,3-dimethylphenyl)piperazin-1-yl]-2-oxoethyl]-1H-indole-2-carboxylic acid 5-chloro-3-{2-[4-(2,3-dimethylphenyl)piperazin-1-yl]-2-oxoethyl}-1H-indole-2-carboxylic acid SMR000025686 | cid_3237041
Type:
Small organic molecule
Emp. Form.:
C23H24ClN3O3
Mol. Mass.:
425.908
SMILES:
Cc1cccc(N2CCN(CC2)C(=O)Cc2c([nH]c3ccc(Cl)cc23)C(O)=O)c1C
:
Substrate
Name:
Not Available
Synonyms:
Type:
Mol. Mass.:
358.43
Organism:
Description:
Residue:
3
NA