Target
5-hydroxytryptamine receptor 1A
Ligand
BDBM30853
Substrate
Not Available
Meas. Tech.
Dose Response Assay for Agonists of 5-Hydroxytryptamine (Serotonin) Receptor Subtype 1A (5HT1A)
pH
7.4±n/a
Temperature
296.15±n/a K
EC50
2219±n/a nM
Citation
 PubChem, PC Dose Response assay for agonists of 5-Hydroxytryptamine (Serotonin) Receptor Subtype 1A (5HT1A) PubChem Bioassay (2007)[AID] 
Target
Name:
5-hydroxytryptamine receptor 1A
Synonyms:
5-HT-1A 5-hydroxytryptamine receptor 1A (5-HT-1A) ADRB2RL1 Dopamine D2 receptor and serotonin 1a receptor HTR1A | Serotonin receptor 1A
Type:
Mol. Mass.:
46122.49
Organism:
Homo sapiens (Human)
Description:
Residue:
422
  
Inhibitor
Name:
BDBM30853
Synonyms:
2-(5-fluoranyl-1H-indol-3-yl)ethanamine;hydrochloride 2-(5-fluoro-1H-indol-3-yl)ethylamine;hydrochloride CHEMBL275628 SMR000033820 | cid_197774
Type:
Small organic molecule
Emp. Form.:
C10H11FN2
Mol. Mass.:
178.2061
SMILES:
NCCc1c[nH]c2ccc(F)cc12
:
Substrate
Name:
Not Available
Synonyms:
Type:
Mol. Mass.:
358.43
Organism:
Description:
Residue:
3
NA