Target
5-hydroxytryptamine receptor 1A
Ligand
BDBM31027
Substrate
Not Available
Meas. Tech.
Dose Response Assay for Agonists of 5-Hydroxytryptamine (Serotonin) Receptor Subtype 1A (5HT1A)
pH
7.4±n/a
Temperature
296.15±n/a K
EC50
50000±n/a nM
Citation
 PubChem, PC Dose Response assay for agonists of 5-Hydroxytryptamine (Serotonin) Receptor Subtype 1A (5HT1A) PubChem Bioassay (2007)[AID] 
Target
Name:
5-hydroxytryptamine receptor 1A
Synonyms:
5-HT-1A 5-hydroxytryptamine receptor 1A (5-HT-1A) ADRB2RL1 Dopamine D2 receptor and serotonin 1a receptor HTR1A | Serotonin receptor 1A
Type:
Mol. Mass.:
46122.49
Organism:
Homo sapiens (Human)
Description:
Residue:
422
  
Inhibitor
Name:
BDBM31027
Synonyms:
1-[[5-[[butyl(ethyl)amino]methyl]-2-furanyl]methyl]-3-(2,4-dimethoxyphenyl)urea 1-[[5-[[butyl(ethyl)amino]methyl]furan-2-yl]methyl]-3-(2,4-dimethoxyphenyl)urea N-[(5-{[butyl(ethyl)amino]methyl}-2-furyl)methyl]-N'-(2,4-dimethoxyphenyl)urea cid_3240509
Type:
Small organic molecule
Emp. Form.:
C21H31N3O4
Mol. Mass.:
389.4885
SMILES:
CCCCN(CC)Cc1ccc(CNC(=O)Nc2ccc(OC)cc2OC)o1
:
Substrate
Name:
Not Available
Synonyms:
Type:
Mol. Mass.:
358.43
Organism:
Description:
Residue:
3
NA