Target
5-hydroxytryptamine receptor 1A
Ligand
BDBM31043
Substrate
Not Available
Meas. Tech.
Dose Response Assay for Agonists of 5-Hydroxytryptamine (Serotonin) Receptor Subtype 1A (5HT1A)
pH
7.4±n/a
Temperature
296.15±n/a K
IC50
3262±n/a nM
Citation
 PubChem, PC Dose Response Cell Based Assay for Antagonists of the 5-Hydroxytryptamine Receptor Subtype 1A (5HT1A) PubChem Bioassay (2007)[AID] 
Target
Name:
5-hydroxytryptamine receptor 1A
Synonyms:
5-HT-1A 5-hydroxytryptamine receptor 1A (5-HT-1A) ADRB2RL1 Dopamine D2 receptor and serotonin 1a receptor HTR1A | Serotonin receptor 1A
Type:
Mol. Mass.:
46122.49
Organism:
Homo sapiens (Human)
Description:
Residue:
422
  
Inhibitor
Name:
BDBM31043
Synonyms:
3,6-dioxido-7-(p-tolyl)-4,5-dihydrotriazolo[4,5-e][2,1,3]benzoxadiazole-3,6-diium 7-(4-methylphenyl)-3,6-dioxido-4,5-dihydrotriazolo[4,5-e][2,1,3]benzoxadiazole-3,6-diium MLS000075614 cid_650038
Type:
Small organic molecule
Emp. Form.:
C13H11N5O3
Mol. Mass.:
285.2581
SMILES:
Cc1ccc(cc1)-n1nc2-c3n[o+]n([O-])c3CCc2[n+]1[O-]
:
Substrate
Name:
Not Available
Synonyms:
Type:
Mol. Mass.:
358.43
Organism:
Description:
Residue:
3
NA