Target
5-hydroxytryptamine receptor 1A
Ligand
BDBM31044
Substrate
Not Available
Meas. Tech.
Dose Response Assay for Agonists of 5-Hydroxytryptamine (Serotonin) Receptor Subtype 1A (5HT1A)
pH
7.4±n/a
Temperature
296.15±n/a K
IC50
421±n/a nM
Citation
 PubChem, PC Dose Response Cell Based Assay for Antagonists of the 5-Hydroxytryptamine Receptor Subtype 1A (5HT1A) PubChem Bioassay (2007)[AID] 
Target
Name:
5-hydroxytryptamine receptor 1A
Synonyms:
5-HT-1A 5-hydroxytryptamine receptor 1A (5-HT-1A) ADRB2RL1 Dopamine D2 receptor and serotonin 1a receptor HTR1A | Serotonin receptor 1A
Type:
Mol. Mass.:
46122.49
Organism:
Homo sapiens (Human)
Description:
Residue:
422
  
Inhibitor
Name:
BDBM31044
Synonyms:
1-Ethyl-6-methyl-3-thiophen-2-yl-1H-pyrimido[5,4-e][1,2,4]triazine-5,7-dione 1-ethyl-6-methyl-3-thiophen-2-yl-pyrimido[5,4-e][1,2,4]triazine-5,7-dione MLS000033110 US9073941, 610 | cid_653297
Type:
Small organic molecule
Emp. Form.:
C12H11N5O2S
Mol. Mass.:
289.313
SMILES:
CCn1nc(nc2c1nc(=O)n(C)c2=O)-c1cccs1
:
Substrate
Name:
Not Available
Synonyms:
Type:
Mol. Mass.:
358.43
Organism:
Description:
Residue:
3
NA