Target
5-hydroxytryptamine receptor 1A
Ligand
BDBM31054
Substrate
Not Available
Meas. Tech.
Dose Response Assay for Agonists of 5-Hydroxytryptamine (Serotonin) Receptor Subtype 1A (5HT1A)
pH
7.4±n/a
Temperature
296.15±n/a K
IC50
1235±n/a nM
Citation
 PubChem, PC Dose Response Cell Based Assay for Antagonists of the 5-Hydroxytryptamine Receptor Subtype 1A (5HT1A) PubChem Bioassay (2007)[AID] 
Target
Name:
5-hydroxytryptamine receptor 1A
Synonyms:
5-HT-1A 5-hydroxytryptamine receptor 1A (5-HT-1A) ADRB2RL1 Dopamine D2 receptor and serotonin 1a receptor HTR1A | Serotonin receptor 1A
Type:
Mol. Mass.:
46122.49
Organism:
Homo sapiens (Human)
Description:
Residue:
422
  
Inhibitor
Name:
BDBM31054
Synonyms:
(2E)-3,3,3-trifluoro-2-(4-keto-6-methyl-[1,3]oxathiolo[4,5-c]pyran-2-ylidene)propionic acid methyl ester MLS000078159 cid_660939 methyl (2E)-3,3,3-tris(fluoranyl)-2-(6-methyl-4-oxidanylidene-[1,3]oxathiolo[4,5-c]pyran-2-ylidene)propanoate
Type:
Small organic molecule
Emp. Form.:
C11H7F3O5S
Mol. Mass.:
308.23
SMILES:
COC(=O)C(=C1\Oc2cc(C)oc(=O)c2S1)\C(F)(F)F
:
Substrate
Name:
Not Available
Synonyms:
Type:
Mol. Mass.:
358.43
Organism:
Description:
Residue:
3
NA