Target
D-amino-acid oxidase
Ligand
BDBM31149
Substrate
BDBM23167
Meas. Tech.
DAAO in Vitro Activity Assay
IC50
180±n/a nM
Citation
 Duplantier, AJBecker, SLBohanon, MJBorzilleri, KAChrunyk, BADowns, JTHu, LYEl-Kattan, AJames, LCLiu, SLu, JMaklad, NMansour, MNMente, SPiotrowski, MASakya, SMSheehan, SSteyn, SJStrick, CAWilliams, VAZhang, L Discovery, SAR, and pharmacokinetics of a novel 3-hydroxyquinolin-2(1H)-one series of potent D-amino acid oxidase (DAAO) inhibitors. J Med Chem 52:3576-85 (2009)  
Target
Name:
D-amino-acid oxidase
Synonyms:
D-Amino Acid Oxidase (DAAO) Dao OXDA_RAT
Type:
Homodimer
Mol. Mass.:
38824.91
Organism:
Rattus norvegicus (rat)
Description:
Recombinant rat DAAO expressed and purified from sf9 insect cells, was used in enzyme assays.
Residue:
346
  
Inhibitor
Name:
BDBM31149
Synonyms:
3-hydroxyquinolin-2(1H)-one, 3
Type:
Small organic molecule
Emp. Form.:
C9H6FNO2
Mol. Mass.:
179.1478
SMILES:
Oc1cc2cccc(F)c2[nH]c1=O
:
Substrate
Name:
BDBM23167
Synonyms:
(2R)-2-amino-3-hydroxypropanoic acid D-Serine
Type:
Amino Acid
Emp. Form.:
C3H7NO3
Mol. Mass.:
105.0926
SMILES:
N[C@H](CO)C(O)=O
: