Target
E3 ubiquitin-protein ligase Mdm2
Ligand
BDBM31226
Substrate
6-FAM labeled octapeptide
Meas. Tech.
Fluorescence Polarization (FP) Binding Assay
pH
7.4±n/a
Temperature
296.15±n/a K
Ki
600±n/a nM
Citation
 Zhang, RMayhood, TLipari, PWang, YDurkin, JSyto, RGesell, JMcNemar, CWindsor, W Fluorescence polarization assay and inhibitor design for MDM2/p53 interaction. Anal Biochem 331:138-46 (2004)  
Target
Name:
E3 ubiquitin-protein ligase Mdm2
Synonyms:
Double minute 2 protein E3 ubiquitin-protein ligase Mdm2 (p53-binding protein Mdm2) Human Double Minute 2 (HDM2) MDM2-MDMX p53-Binding Protein MDM2 | p53-binding protein
Type:
Oncoprotein
Mol. Mass.:
55196.54
Organism:
Homo sapiens (Human)
Description:
Q00987
Residue:
491
  
Inhibitor
Name:
BDBM31226
Synonyms:
2-phenoxybenzoyltryptophan derivative, R5C4
Type:
Small organic molecule
Emp. Form.:
C39H34N2O5
Mol. Mass.:
610.6977
SMILES:
Cc1ccc2n(Cc3ccc(OCc4ccccc4)cc3)cc(C[C@H](NC(=O)c3ccccc3Oc3ccccc3)C(O)=O)c2c1
:
Substrate
Name:
6-FAM labeled octapeptide
Synonyms:
Type:
fluorescent peptide
Mol. Mass.:
2832.21
Organism:
Description:
Fluorophore 6-carboxyfluorescein was covalently attached to the side chain amino group of the Dpr residue in the peptide.
Residue:
26