Target
5-hydroxytryptamine receptor 1E
Ligand
BDBM31014
Substrate
Not Available
Meas. Tech.
Dose Response Cell Based High Throughput Screening Assay for Agonists of the 5-Hydroxytryptamine Receptor Subtype 1E (5HT1E)
pH
7.4±n/a
Temperature
296.15±n/a K
EC50
50000±n/a nM
Citation
 PubChem, PC Dose Response Cell Based High Throughput Screening Assay for Agonists of the 5-Hydroxytryptamine Receptor Subtype 1E (5HT1E) PubChem Bioassay (2007)[AID] 
Target
Name:
5-hydroxytryptamine receptor 1E
Synonyms:
5-HT-1E 5-Hydroxytryptamine Receptor Subtype 1E (5HT1E) 5-hydroxytryptamine receptor 1E (5-HT-1E) (S31) 5HT1E_HUMAN S31 Serotonin 1e (5-HT1e) receptor | Serotonin Receptor 1E
Type:
G Protein-Coupled Receptor (GPCR)
Mol. Mass.:
41697.80
Organism:
Homo sapiens (Human)
Description:
gi_112822
Residue:
365
  
Inhibitor
Name:
BDBM31014
Synonyms:
MLS000081936 N-[4-[(4-hydroxyphenyl)-methyl-sulfamoyl]phenyl]ethanamide SMR000062983 | cid_2998367
Type:
Small organic molecule
Emp. Form.:
C15H16N2O4S
Mol. Mass.:
320.364
SMILES:
CN(c1ccc(O)cc1)S(=O)(=O)c1ccc(NC(C)=O)cc1
:
Substrate
Name:
Not Available
Synonyms:
Type:
Mol. Mass.:
358.43
Organism:
Description:
Residue:
3
NA