Target
5-hydroxytryptamine receptor 1E
Ligand
BDBM31052
Substrate
Not Available
Meas. Tech.
Dose Response Cell Based Assay for Antagonists of the 5-Hydroxytryptamine Receptor Subtype 1E (5HT1E
pH
7.4±n/a
Temperature
296.15±n/a K
IC50
10090±n/a nM
Citation
 PubChem, PC Dose Response Cell Based Assay for Antagonists of the 5-Hydroxytryptamine Receptor Subtype 1E (5HT1E) PubChem Bioassay (2007)[AID] 
Target
Name:
5-hydroxytryptamine receptor 1E
Synonyms:
5-HT-1E 5-Hydroxytryptamine Receptor Subtype 1E (5HT1E) 5-hydroxytryptamine receptor 1E (5-HT-1E) (S31) 5HT1E_HUMAN S31 Serotonin 1e (5-HT1e) receptor | Serotonin Receptor 1E
Type:
G Protein-Coupled Receptor (GPCR)
Mol. Mass.:
41697.80
Organism:
Homo sapiens (Human)
Description:
gi_112822
Residue:
365
  
Inhibitor
Name:
BDBM31052
Synonyms:
1-[1,1-bis(trifluoromethyl)propyl]-3-[5-(trifluoromethyl)-1,3,4-thiadiazol-2-yl]urea 1-[5-(trifluoromethyl)-1,3,4-thiadiazol-2-yl]-3-[1,1,1-tris(fluoranyl)-2-(trifluoromethyl)butan-2-yl]urea SMR000040781 | cid_659822
Type:
Small organic molecule
Emp. Form.:
C9H7F9N4OS
Mol. Mass.:
390.229
SMILES:
CCC(NC(=O)Nc1nnc(s1)C(F)(F)F)(C(F)(F)F)C(F)(F)F
:
Substrate
Name:
Not Available
Synonyms:
Type:
Mol. Mass.:
358.43
Organism:
Description:
Residue:
3
NA