Target
5-hydroxytryptamine receptor 1E
Ligand
BDBM31065
Substrate
Not Available
Meas. Tech.
Dose Response Cell Based Assay for Antagonists of the 5-Hydroxytryptamine Receptor Subtype 1E (5HT1E
pH
7.4±n/a
Temperature
296.15±n/a K
IC50
50000±n/a nM
Citation
 PubChem, PC Dose Response Cell Based Assay for Antagonists of the 5-Hydroxytryptamine Receptor Subtype 1E (5HT1E) PubChem Bioassay (2007)[AID] 
Target
Name:
5-hydroxytryptamine receptor 1E
Synonyms:
5-HT-1E 5-Hydroxytryptamine Receptor Subtype 1E (5HT1E) 5-hydroxytryptamine receptor 1E (5-HT-1E) (S31) 5HT1E_HUMAN S31 Serotonin 1e (5-HT1e) receptor | Serotonin Receptor 1E
Type:
G Protein-Coupled Receptor (GPCR)
Mol. Mass.:
41697.80
Organism:
Homo sapiens (Human)
Description:
gi_112822
Residue:
365
  
Inhibitor
Name:
BDBM31065
Synonyms:
2-methoxyethyl 3-methyl-4-oxidanylidene-6-phenyl-1,5,6,7-tetrahydroindole-2-carboxylate 2-methoxyethyl 3-methyl-4-oxo-6-phenyl-4,5,6,7-tetrahydro-1H-indole-2-carboxylate 4-keto-3-methyl-6-phenyl-1,5,6,7-tetrahydroindole-2-carboxylic acid 2-methoxyethyl ester SMR000025505 | cid_3239810
Type:
Small organic molecule
Emp. Form.:
C19H21NO4
Mol. Mass.:
327.3743
SMILES:
COCCOC(=O)c1[nH]c2CC(CC(=O)c2c1C)c1ccccc1
:
Substrate
Name:
Not Available
Synonyms:
Type:
Mol. Mass.:
358.43
Organism:
Description:
Residue:
3
NA