Target
5-hydroxytryptamine receptor 1E
Ligand
BDBM31066
Substrate
Not Available
Meas. Tech.
Dose Response Cell Based Assay for Antagonists of the 5-Hydroxytryptamine Receptor Subtype 1E (5HT1E
pH
7.4±n/a
Temperature
296.15±n/a K
IC50
2790±n/a nM
Citation
 PubChem, PC Dose Response Cell Based Assay for Antagonists of the 5-Hydroxytryptamine Receptor Subtype 1E (5HT1E) PubChem Bioassay (2007)[AID] 
Target
Name:
5-hydroxytryptamine receptor 1E
Synonyms:
5-HT-1E 5-Hydroxytryptamine Receptor Subtype 1E (5HT1E) 5-hydroxytryptamine receptor 1E (5-HT-1E) (S31) 5HT1E_HUMAN S31 Serotonin 1e (5-HT1e) receptor | Serotonin Receptor 1E
Type:
G Protein-Coupled Receptor (GPCR)
Mol. Mass.:
41697.80
Organism:
Homo sapiens (Human)
Description:
gi_112822
Residue:
365
  
Inhibitor
Name:
BDBM31066
Synonyms:
3-(1-phenyltetrazol-5-yl)sulfonylpropanenitrile 3-[(1-phenyl-1,2,3,4-tetrazol-5-yl)sulfonyl]propanenitrile 3-[(1-phenyl-5-tetrazolyl)sulfonyl]propanenitrile SMR000021278 | cid_3242053
Type:
Small organic molecule
Emp. Form.:
C10H9N5O2S
Mol. Mass.:
263.276
SMILES:
O=S(=O)(CCC#N)c1nnnn1-c1ccccc1
:
Substrate
Name:
Not Available
Synonyms:
Type:
Mol. Mass.:
358.43
Organism:
Description:
Residue:
3
NA