Target
5-hydroxytryptamine receptor 1E
Ligand
BDBM31076
Substrate
Not Available
Meas. Tech.
Dose Response Cell Based Assay for Antagonists of the 5-Hydroxytryptamine Receptor Subtype 1E (5HT1E
pH
7.4±n/a
Temperature
296.15±n/a K
IC50
2612±n/a nM
Citation
 PubChem, PC Dose Response Cell Based Assay for Antagonists of the 5-Hydroxytryptamine Receptor Subtype 1E (5HT1E) PubChem Bioassay (2007)[AID] 
Target
Name:
5-hydroxytryptamine receptor 1E
Synonyms:
5-HT-1E 5-Hydroxytryptamine Receptor Subtype 1E (5HT1E) 5-hydroxytryptamine receptor 1E (5-HT-1E) (S31) 5HT1E_HUMAN S31 Serotonin 1e (5-HT1e) receptor | Serotonin Receptor 1E
Type:
G Protein-Coupled Receptor (GPCR)
Mol. Mass.:
41697.80
Organism:
Homo sapiens (Human)
Description:
gi_112822
Residue:
365
  
Inhibitor
Name:
BDBM31076
Synonyms:
2-[1-(4-methoxyphenyl)tetrazol-5-yl]sulfonyl-1-piperidin-1-ylethanone 2-[[1-(4-methoxyphenyl)-1,2,3,4-tetrazol-5-yl]sulfonyl]-1-piperidin-1-yl-ethanone MLS000119145 cid_1263400
Type:
Small organic molecule
Emp. Form.:
C15H19N5O4S
Mol. Mass.:
365.407
SMILES:
COc1ccc(cc1)-n1nnnc1S(=O)(=O)CC(=O)N1CCCCC1
:
Substrate
Name:
Not Available
Synonyms:
Type:
Mol. Mass.:
358.43
Organism:
Description:
Residue:
3
NA