Target
5-hydroxytryptamine receptor 1E
Ligand
BDBM31366
Substrate
Not Available
Meas. Tech.
Counterscreen assay for S1P3 antagonists: Dose response cell-based high throughput screening assay to identify antagonists of the 5-Hydroxytryptamine Receptor Subtype 1E (5HT1E)
pH
7.4±n/a
Temperature
296.15±n/a K
IC50
50000±n/a nM
Citation
 PubChem, PC Counterscreen assay for S1P3 antagonists: Dose response cell-based high throughput screening assay to identify antagonists of the 5-Hydroxytryptamine Receptor Subtype 1E (5HT1E) PubChem Bioassay (2009)[AID] 
Target
Name:
5-hydroxytryptamine receptor 1E
Synonyms:
5-HT-1E 5-Hydroxytryptamine Receptor Subtype 1E (5HT1E) 5-hydroxytryptamine receptor 1E (5-HT-1E) (S31) 5HT1E_HUMAN S31 Serotonin 1e (5-HT1e) receptor | Serotonin Receptor 1E
Type:
G Protein-Coupled Receptor (GPCR)
Mol. Mass.:
41697.80
Organism:
Homo sapiens (Human)
Description:
gi_112822
Residue:
365
  
Inhibitor
Name:
BDBM31366
Synonyms:
4-(4-fluorophenyl)-1,3-dimethyl-2,6-diphenyl-4-piperidinol 4-(4-fluorophenyl)-1,3-dimethyl-2,6-diphenylpiperidin-4-ol SMR000281311 | cid_2729786
Type:
Small organic molecule
Emp. Form.:
C25H26FNO
Mol. Mass.:
375.4784
SMILES:
CC1C(N(C)C(CC1(O)c1ccc(F)cc1)c1ccccc1)c1ccccc1
:
Substrate
Name:
Not Available
Synonyms:
Type:
Mol. Mass.:
358.43
Organism:
Description:
Residue:
3
NA