Target
Heat shock 70 kDa protein 1A
Ligand
BDBM31701
Substrate
Fluorescein-12-ATP
Meas. Tech.
High Throughput Screening Assay for Hsp70 Inhibitors
pH
7±n/a
Temperature
296.15±n/a K
IC50
100000±n/a nM
Citation
 PubChem, PC High Throughput Screening Assay for Hsp70 Inhibitors PubChem Bioassay (2008)[AID] 
Target
Name:
Heat shock 70 kDa protein 1A
Synonyms:
HSPA1A V9GZ37_HUMAN | heat shock 70kDa protein 1A
Type:
ATP-binding protein
Mol. Mass.:
51937.99
Organism:
Homo sapiens (Human)
Description:
gi_123271505; GST-tagged ATPase domain
Residue:
476
  
Inhibitor
Name:
BDBM31701
Synonyms:
3-(2-furanyl)-N-(3-methoxypropyl)-3-[(4-methylphenyl)sulfonylamino]propanamide 3-(2-furyl)-N-(3-methoxypropyl)-3-{[(4-methylphenyl)sulfonyl]amino}propanamide MLS000047323 cid_3239172
Type:
Small organic molecule
Emp. Form.:
C18H24N2O5S
Mol. Mass.:
380.459
SMILES:
COCCCNC(=O)CC(NS(=O)(=O)c1ccc(C)cc1)c1ccco1
:
Substrate
Name:
Fluorescein-12-ATP
Synonyms:
Type:
Mol. Mass.:
358.43
Organism:
Description:
Residue:
3
NA