Target
Heat shock 70 kDa protein 1A
Ligand
BDBM31706
Substrate
Fluorescein-12-ATP
Meas. Tech.
High Throughput Screening Assay for Hsp70 Inhibitors
pH
7±n/a
Temperature
296.15±n/a K
IC50
100000±n/a nM
Citation
 PubChem, PC High Throughput Screening Assay for Hsp70 Inhibitors PubChem Bioassay (2008)[AID] 
Target
Name:
Heat shock 70 kDa protein 1A
Synonyms:
HSPA1A V9GZ37_HUMAN | heat shock 70kDa protein 1A
Type:
ATP-binding protein
Mol. Mass.:
51937.99
Organism:
Homo sapiens (Human)
Description:
gi_123271505; GST-tagged ATPase domain
Residue:
476
  
Inhibitor
Name:
BDBM31706
Synonyms:
2-(2-ethoxyphenyl)-5,6-dimethyl-1,3-dihydroisoindole MLS000114640 cid_954417
Type:
Small organic molecule
Emp. Form.:
C18H21NO
Mol. Mass.:
267.3654
SMILES:
CCOc1ccccc1N1Cc2cc(C)c(C)cc2C1
:
Substrate
Name:
Fluorescein-12-ATP
Synonyms:
Type:
Mol. Mass.:
358.43
Organism:
Description:
Residue:
3
NA