Target
Dual specificity protein phosphatase 6
Ligand
BDBM31723
Substrate
3-O-methylfluorescein phosphate (OMFP)
Meas. Tech.
In Vitro MKP-3 Dose Response Assay for SAR Study
pH
7±n/a
Temperature
296.15±n/a K
IC50
47500±n/a nM
Citation
 PubChem, PC In Vitro MKP-3 Dose Response Assay for SAR Study PubChem Bioassay (2008)[AID] 
Target
Name:
Dual specificity protein phosphatase 6
Synonyms:
DUS6_RAT MAP kinase phosphatase 3 Mitogen-activated protein kinase phosphatase 3 | Mkp3
Type:
Enzyme
Mol. Mass.:
42303.19
Organism:
Rattus norvegicus
Description:
gi_16758752
Residue:
381
  
Inhibitor
Name:
BDBM31723
Synonyms:
8-nitro-3a,4,5,9b-tetrahydro-3H-cyclopenta[c]quinoline-4-carboxylic acid cid_3112185
Type:
Small organic molecule
Emp. Form.:
C13H12N2O4
Mol. Mass.:
260.2454
SMILES:
OC(=O)C1Nc2ccc(cc2C2C=CCC12)[N+]([O-])=O
:
Substrate
Name:
3-O-methylfluorescein phosphate (OMFP)
Synonyms:
Type:
Mol. Mass.:
358.43
Organism:
Description:
Residue:
3
NA