Target
2-C-methyl-D-erythritol 2,4-cyclodiphosphate synthase
Ligand
BDBM31915
Substrate
BDBM10852
Meas. Tech.
SPR Biosensor Assay
pH
7±n/a
Temperature
283.15±n/a K
Kd
40000000±n/a nM
Citation
 Ramsden, NLBuetow, LDawson, AKemp, LAUlaganathan, VBrenk, RKlebe, GHunter, WN A structure-based approach to ligand discovery for 2C-methyl-D-erythritol-2,4-cyclodiphosphate synthase: a target for antimicrobial therapy. J Med Chem 52:2531-42 (2009)  
Target
Name:
2-C-methyl-D-erythritol 2,4-cyclodiphosphate synthase
Synonyms:
2C-methyl-D-erythritol-2,4-cyclodiphosphate synthase (IspF) MECDP-synthase ispF ygbB
Type:
Homotrimer
Mol. Mass.:
16897.34
Organism:
Escherichia coli (strain K12)
Description:
P62617
Residue:
159
  
Inhibitor
Name:
BDBM31915
Synonyms:
CDV HPMPC Vistide
Type:
Small organic molecule
Emp. Form.:
C8H14N3O6P
Mol. Mass.:
279.187
SMILES:
Nc1ccn(C[C@@H](CO)OCP(O)(O)=O)c(=O)n1
:
Substrate