Target
A disintegrin and metalloproteinase with thrombospondin motifs 4
Ligand
BDBM50337736
Substrate
Meas. Tech.
Immunoblotting
IC50
0.490±n/a nM
Citation
 Vistnes, MChristensen, GAronsen, MLunde, IGSjaastad, ICarlson, CR Inhibitors of ADAMTS4 or ADAMTS5 for use in preventing or treating cardiac remodeling and chronic heart failure US Patent  US10322143 Publication Date 6/18/2019 
Target
Name:
A disintegrin and metalloproteinase with thrombospondin motifs 4
Synonyms:
A disintegrin and metalloproteinase with thrombospondin motifs 4 (ADAMTS-4) ATS4_HUMAN KIAA0688 | Metalloproteinase with thrombospondin motifs 4 (ADAMTS-4)
Type:
Enzyme
Mol. Mass.:
90214.54
Organism:
Homo sapiens (Human)
Description:
O75173
Residue:
837
  
Inhibitor
Name:
BDBM50337736
Synonyms:
CHEMBL1683455 US10322143, Compound 8h
Type:
Small organic molecule
Emp. Form.:
C26H34F4N4O4S
Mol. Mass.:
574.631
SMILES:
C[C@@H](C[C@@](C)(CS(=O)(=O)N1CCC(CCc2ccc(cc2C)C(F)(F)F)CC1)N(O)C=O)c1ncc(F)cn1
: