Target
Isoform Bcl-X(L) of Bcl-2-like protein 1 (Bcl-xL)
Ligand
BDBM32260
Substrate
F-Bim
Meas. Tech.
Multiplexed dose response screen for small molecule regulators of Bcl-2 family protein interactions, specifically Bim-Bcl-XL.
pH
7.4±n/a
Temperature
277.15±n/a K
EC50
14330±n/a nM
Citation
 PubChem, PC Multiplexed dose response screen for small molecule regulators of Bcl-2 family protein interactions, specifically Bim-Bcl-XL. PubChem Bioassay (2008)[AID] 
Target
Name:
Isoform Bcl-X(L) of Bcl-2-like protein 1 (Bcl-xL)
Synonyms:
B-cell lymphoma-extra large protein (Bcl-xL) BCL-xL BCL2L1 Bcl-2-like protein 1 (Bcl-xL) | Isoform Bcl-X(L)
Type:
Homodimers/heterodimers with BAX, BAK and BCL2
Mol. Mass.:
26053.63
Organism:
Homo sapiens (Human)
Description:
gi_510901
Residue:
233
  
Inhibitor
Name:
BDBM32260
Synonyms:
6-(4-ethoxyphenyl)-3-(2-pyridinyl)-7H-[1,2,4]triazolo[3,4-b][1,3,4]thiadiazine 6-p-phenetyl-3-(2-pyridyl)-7H-[1,2,4]triazolo[3,4-b][1,3,4]thiadiazine SMR000042988 | cid_662251
Type:
Small organic molecule
Emp. Form.:
C17H15N5OS
Mol. Mass.:
337.399
SMILES:
CCOc1ccc(cc1)C1=Nn2c(SC1)nnc2-c1ccccn1
:
Substrate
Name:
F-Bim
Synonyms:
Type:
fluorescent peptide probe
Mol. Mass.:
3923.40
Organism:
Description:
Residue:
32