Target
Isoform Bcl-X(L) of Bcl-2-like protein 1 (Bcl-xL)
Ligand
BDBM32280
Substrate
F-Bim
Meas. Tech.
Multiplexed dose response screen for small molecule regulators of Bcl-2 family protein interactions, specifically Bim-Bcl-XL.
pH
7.4±n/a
Temperature
277.15±n/a K
EC50
23130±n/a nM
Citation
 PubChem, PC Multiplexed dose response screen for small molecule regulators of Bcl-2 family protein interactions, specifically Bim-Bcl-XL. PubChem Bioassay (2008)[AID] 
Target
Name:
Isoform Bcl-X(L) of Bcl-2-like protein 1 (Bcl-xL)
Synonyms:
B-cell lymphoma-extra large protein (Bcl-xL) BCL-xL BCL2L1 Bcl-2-like protein 1 (Bcl-xL) | Isoform Bcl-X(L)
Type:
Homodimers/heterodimers with BAX, BAK and BCL2
Mol. Mass.:
26053.63
Organism:
Homo sapiens (Human)
Description:
gi_510901
Residue:
233
  
Inhibitor
Name:
BDBM32280
Synonyms:
MLS000534769 N-(4-acetylphenyl)-2,3-bis(2-furyl)quinoxaline-6-carboxamide N-(4-acetylphenyl)-2,3-di-2-furyl-6-quinoxalinecarboxamide SMR000142225 | cid_1331726
Type:
Small organic molecule
Emp. Form.:
C25H17N3O4
Mol. Mass.:
423.4202
SMILES:
CC(=O)c1ccc(NC(=O)c2ccc3nc(-c4ccco4)c(nc3c2)-c2ccco2)cc1
:
Substrate
Name:
F-Bim
Synonyms:
Type:
fluorescent peptide probe
Mol. Mass.:
3923.40
Organism:
Description:
Residue:
32