Target
Serine/threonine-protein kinase D1
Ligand
BDBM32339
Substrate
Substrate Peptide
Meas. Tech.
Fluorescence polarization assay for PKD inhibitiors-IC50 determinations
pH
7.2±n/a
Temperature
296.15±n/a K
IC50
>50000±n/a nM
Citation
 PubChem, PC Fluorescence polarization assay for PKD inhibitiors-IC50 determinations PubChem Bioassay (2008)[AID] 
Target
Name:
Serine/threonine-protein kinase D1
Synonyms:
KPCD1_HUMAN PKD1 PRKD1 Protein kinase C mu type Protein kinase C, PKC; classical/novel Protein kinase D (PRKD1) nPKC-D1 | nPKC-mu
Type:
Serine/threonine-protein kinase
Mol. Mass.:
101705.07
Organism:
Homo sapiens (Human)
Description:
gi_115529463
Residue:
912
  
Inhibitor
Name:
BDBM32339
Synonyms:
5-Bromo-furan-2-carboxylic acid [2-(4-methanesulfonyl-piperazin-1-yl)-phenyl]-amide 5-bromo-N-[2-(4-mesylpiperazino)phenyl]-2-furamide 5-bromo-N-[2-(4-methylsulfonylpiperazin-1-yl)phenyl]furan-2-carboxamide SMR000124483 | cid_979832
Type:
Small organic molecule
Emp. Form.:
C16H18BrN3O4S
Mol. Mass.:
428.301
SMILES:
CS(=O)(=O)N1CCN(CC1)c1ccccc1NC(=O)c1ccc(Br)o1
:
Substrate
Name:
Substrate Peptide
Synonyms:
Type:
Peptide
Mol. Mass.:
358.43
Organism:
Description:
ATP as co-substrate
Residue:
3
NA