Target
Serine/threonine-protein kinase D1
Ligand
BDBM32360
Substrate
Substrate Peptide
Meas. Tech.
Fluorescence polarization assay for PKD inhibitiors-IC50 determinations
pH
7.2±n/a
Temperature
296.15±n/a K
IC50
9267.856598±n/a nM
Citation
 PubChem, PC Fluorescence polarization assay for PKD inhibitiors-IC50 determinations PubChem Bioassay (2008)[AID] 
Target
Name:
Serine/threonine-protein kinase D1
Synonyms:
KPCD1_HUMAN PKD1 PRKD1 Protein kinase C mu type Protein kinase C, PKC; classical/novel Protein kinase D (PRKD1) nPKC-D1 | nPKC-mu
Type:
Serine/threonine-protein kinase
Mol. Mass.:
101705.07
Organism:
Homo sapiens (Human)
Description:
gi_115529463
Residue:
912
  
Inhibitor
Name:
BDBM32360
Synonyms:
(3,5-dichloro-2-pyridyl)-[1-(2-pyridyl)ethylideneamino]amine 3,5-dichloro-N-(1-pyridin-2-ylethylideneamino)pyridin-2-amine MLS000772548 cid_3351416
Type:
Small organic molecule
Emp. Form.:
C12H10Cl2N4
Mol. Mass.:
281.141
SMILES:
CC(N=Nc1ncc(Cl)cc1Cl)c1ccccn1
:
Substrate
Name:
Substrate Peptide
Synonyms:
Type:
Peptide
Mol. Mass.:
358.43
Organism:
Description:
ATP as co-substrate
Residue:
3
NA