Target
Alpha-2C adrenergic receptor
Ligand
BDBM398512
Substrate
Meas. Tech.
Antagonism Against Adrenoreceptors
IC50
31.0±n/a nM
Citation
 Becker-Pelster, EMBuchgraber, PBuchmüller, AEngel, KGeiss, VGöller, AHimmel, HKast, RKnorr, ALang, DRedlich, GSchmeck, CTinel, HWunder, F Substituted piperidinyl tetrahydroquinolines US Patent  US10323020 Publication Date 6/18/2019 
Target
Name:
Alpha-2C adrenergic receptor
Synonyms:
ADA2C_HUMAN ADRA2L2 Adrenergic alpha2C Adrenergic receptor alpha Alpha-2 adrenergic receptor subtype C4 Alpha-2C adrenoreceptor | adrenergic, alpha-2C-, receptor [Homo sapiens]
Type:
Enzyme
Mol. Mass.:
49552.32
Organism:
Homo sapiens (Human)
Description:
P18825
Residue:
462
  
Inhibitor
Name:
BDBM398512
Synonyms:
(rac)-[4-(3,4-Dihydroisoquinolin-2(1H)-yl)piperidin-1-yl]{2-[(1-methoxybutan-2-yl)amino]pyrimidin-5-yl}methanone | US10323020, Example 6
Type:
Small organic molecule
Emp. Form.:
C24H33N5O2
Mol. Mass.:
423.5511
SMILES:
CCC(COC)Nc1ncc(cn1)C(=O)N1CCC(CC1)N1CCc2ccccc2C1
: