Target
Dimer of Gag-Pol polyprotein [501-599,Q508K,L534I,L564I,C568A,C596A,D531N]
Ligand
BDBM579
Substrate
Chromogenic peptide substrate
Meas. Tech.
Protease Inhibition Assay
pH
4.7±n/a
Temperature
310.15±n/a K
Ki
0.9±0.2 nM
Km
28000±3000 nM
kcat
17±2 1/sec
Citation
 Clemente, JCHemrajani, RBlum, LEGoodenow, MMDunn, BM Secondary mutations M36I and A71V in the human immunodeficiency virus type 1 protease can provide an advantage for the emergence of the primary mutation D30N. Biochemistry 42:15029-35 (2003)  
Target
Name:
Dimer of Gag-Pol polyprotein [501-599,Q508K,L534I,L564I,C568A,C596A,D531N]
Synonyms:
HIV-1 Protease Mutant (D30N)
Type:
Protein Complex
Mol. Mass.:
Description:
Components:
This complex has 2 components.
Component 1
Name:
Gag-Pol polyprotein [501-599,Q508K,L534I,L564I,C568A,C596A,D531N]
Synonyms:
HIV-1 Protease Mutant (D30N) chain A LAI(D30N) gag-pol
Type:
Enzyme Subunit
Mol. Mass.:
10732.13
Organism:
Human immunodeficiency virus type 1
Description:
P03367[501-599,Q508K,L534I,L564I,C568A,C596A,D531N]
Residue:
99
  
Component 2
Name:
Gag-Pol polyprotein [501-599,Q508K,L534I,L564I,C568A,C596A,D531N]
Synonyms:
HIV-1 Protease Mutant (D30N) chain A LAI(D30N) gag-pol
Type:
Enzyme Subunit
Mol. Mass.:
10732.13
Organism:
Human immunodeficiency virus type 1
Description:
P03367[501-599,Q508K,L534I,L564I,C568A,C596A,D531N]
Residue:
99
  
Inhibitor
Name:
BDBM579
Synonyms:
(4R)-N-tert-butyl-3-[(2S,3S)-2-hydroxy-3-[(2R)-2-[2-(isoquinolin-5-yloxy)acetamido]-3-(methylsulfanyl)propanamido]-4-phenylbutanoyl]-1,3-thiazolidine-4-carboxamide KNI-272 iQoa-Mta-Apns-Thz-NH-tBu
Type:
Small organic molecule
Emp. Form.:
C33H41N5O6S2
Mol. Mass.:
667.839
SMILES:
CSC[C@H](NC(=O)COc1cccc2cnccc12)C(=O)N[C@@H](Cc1ccccc1)[C@H](O)C(=O)N1CSC[C@H]1C(=O)NC(C)(C)C
:
Substrate
Name:
Chromogenic peptide substrate
Synonyms:
Chromogenic peptide substrate
Type:
Peptide
Mol. Mass.:
1420.11
Organism:
Description:
Residue:
13
KARVLNPHEANLG