Target
Coagulation factor XI
Ligand
BDBM32675
Substrate
Boc-Glu-Ala-Arg-AMC
Meas. Tech.
Factor XIa Dose Response Confirmation from Single Well Screen
pH
7.4±n/a
Temperature
296.15±n/a K
IC50
>50000±0 nM
Citation
 PubChem, PC Factor XIa Dose Response Confirmation from Single Well Screen PubChem Bioassay (2008)[AID] 
Target
Name:
Coagulation factor XI
Synonyms:
Coagulation factor XIa Coagulation factor XIa light chain FA11_HUMAN Factor XIa PTA | Plasma thromboplastin antecedent
Type:
Enzyme
Mol. Mass.:
70130.58
Organism:
Homo sapiens (Human)
Description:
P03951
Residue:
625
  
Inhibitor
Name:
BDBM32675
Synonyms:
1-(3-bromo-4-methoxybenzoyl)-1H-1,2,3-benzotriazole MLS000048314 benzotriazol-1-yl-(3-bromanyl-4-methoxy-phenyl)methanone benzotriazol-1-yl-(3-bromo-4-methoxyphenyl)methanone | cid_833492
Type:
Small organic molecule
Emp. Form.:
C14H10BrN3O2
Mol. Mass.:
332.152
SMILES:
COc1ccc(cc1Br)C(=O)n1nnc2ccccc12
:
Substrate
Name:
Boc-Glu-Ala-Arg-AMC
Synonyms:
Type:
fluorescent substrate peptide
Mol. Mass.:
358.43
Organism:
Description:
Residue:
3
NA